Reaction Details
TargetTyrosine-protein kinase SYK
LigandBDBM50132439
Substrate/Competitorn/a
Meas. Tech.ChEBML_206946
IC50 937±n/a nM
Citation Lai, JYCox, PJPatel, RSadiq, SAldous, DJThurairatnam, SSmith, KWheeler, DJagpal, SParveen, SFenton, GHarrison, TKMcCarthy, CBamborough, P Potent small molecule inhibitors of spleen tyrosine kinase (Syk). Bioorg Med Chem Lett13:3111-4 (2003) Tyrosine-protein kinase SYK
Name:Tyrosine-protein kinase SYK
Type:Enzyme
Mol. Mass.:72079.99
Organism:Homo sapiens (Human)
Description:P43405
Residue:635
BDBM50132439
NameBDBM50132439
Synonyms:3-[1-(5-Methoxy-1-methyl-1H-indol-3-yl)-meth-(Z)-ylidene]-2-oxo-2,3-dihydro-1H-indole-5-sulfonic acid isobutyl-amide N-isobutyl-3-((5-methoxy-1-methyl-1H-indol-3-yl)methylene)-2-oxoindoline-5-sulfonamide
TypeSmall organic molecule
Emp. Form.C23H25N3O4S
Mol. Mass.439.527
SMILESCOc1ccc2n(C)cc(\C=C3/C(=O)Nc4ccc(cc34)S(=O)(=O)NCC(C)C)c2c1