Reaction Details
TargetLow affinity immunoglobulin epsilon Fc receptor
LigandBDBM50132436
Substrate/Competitorn/a
Meas. Tech.ChEBML_163803
EC50 313±n/a nM
Citation Lai, JYCox, PJPatel, RSadiq, SAldous, DJThurairatnam, SSmith, KWheeler, DJagpal, SParveen, SFenton, GHarrison, TKMcCarthy, CBamborough, P Potent small molecule inhibitors of spleen tyrosine kinase (Syk). Bioorg Med Chem Lett13:3111-4 (2003) Low affinity immunoglobulin epsilon Fc receptor
Name:Low affinity immunoglobulin epsilon Fc receptor
Type:PROTEIN
Mol. Mass.:36461.84
Organism:Homo sapiens (Human)
Description:ChEMBL_88888
Residue:321
BDBM50132436
NameBDBM50132436
Synonyms:3-((1-methyl-1H-indol-3-yl)methylene)-2-oxoindoline-5-sulfonamide CHEMBL104279
TypeSmall organic molecule
Emp. Form.C18H15N3O3S
Mol. Mass.353.395
SMILESCn1cc(\C=C2/C(=O)Nc3ccc(cc23)S(N)(=O)=O)c2ccccc12