Reaction Details
TargetLow affinity immunoglobulin epsilon Fc receptor
LigandBDBM50132448
Substrate/Competitorn/a
Meas. Tech.ChEBML_163803
EC50>10000±n/a nM
Citation Lai, JYCox, PJPatel, RSadiq, SAldous, DJThurairatnam, SSmith, KWheeler, DJagpal, SParveen, SFenton, GHarrison, TKMcCarthy, CBamborough, P Potent small molecule inhibitors of spleen tyrosine kinase (Syk). Bioorg Med Chem Lett13:3111-4 (2003) Low affinity immunoglobulin epsilon Fc receptor
Name:Low affinity immunoglobulin epsilon Fc receptor
Type:PROTEIN
Mol. Mass.:36461.84
Organism:Homo sapiens (Human)
Description:ChEMBL_88888
Residue:321
BDBM50132448
NameBDBM50132448
Synonyms:2-[3-(5-Methoxy-1-methyl-1H-indol-3-ylmethylene)-2-oxo-2,3-dihydro-1H-indole-5-sulfonylamino]-acetamide | CHEMBL108258
TypeSmall organic molecule
Emp. Form.C21H20N4O5S
Mol. Mass.440.472
SMILESCOc1ccc2n(C)cc(\C=C3/C(=O)Nc4ccc(cc34)S(=O)(=O)NCC(N)=O)c2c1