Reaction Details
TargetTyrosine-protein kinase SYK
LigandBDBM50132435
Substrate/Competitorn/a
Meas. Tech.ChEBML_206946
IC50 273±n/a nM
Citation Lai, JYCox, PJPatel, RSadiq, SAldous, DJThurairatnam, SSmith, KWheeler, DJagpal, SParveen, SFenton, GHarrison, TKMcCarthy, CBamborough, P Potent small molecule inhibitors of spleen tyrosine kinase (Syk). Bioorg Med Chem Lett13:3111-4 (2003) Tyrosine-protein kinase SYK
Name:Tyrosine-protein kinase SYK
Type:Enzyme
Mol. Mass.:72079.99
Organism:Homo sapiens (Human)
Description:P43405
Residue:635
BDBM50132435
NameBDBM50132435
Synonyms:3-((5-methoxy-1-methyl-1H-indol-3-yl)methylene)-2-oxoindoline-5-carboxylic acid CHEMBL104813
TypeSmall organic molecule
Emp. Form.C20H16N2O4
Mol. Mass.348.352
SMILESCOc1ccc2n(C)cc(\C=C3/C(=O)Nc4ccc(cc34)C(O)=O)c2c1