Reaction Details
TargetLow affinity immunoglobulin epsilon Fc receptor
LigandBDBM50132454
Substrate/Competitorn/a
Meas. Tech.ChEBML_163803
EC50 6300±n/a nM
Citation Lai, JYCox, PJPatel, RSadiq, SAldous, DJThurairatnam, SSmith, KWheeler, DJagpal, SParveen, SFenton, GHarrison, TKMcCarthy, CBamborough, P Potent small molecule inhibitors of spleen tyrosine kinase (Syk). Bioorg Med Chem Lett13:3111-4 (2003) Low affinity immunoglobulin epsilon Fc receptor
Name:Low affinity immunoglobulin epsilon Fc receptor
Type:PROTEIN
Mol. Mass.:36461.84
Organism:Homo sapiens (Human)
Description:ChEMBL_88888
Residue:321
BDBM50132454
NameBDBM50132454
Synonyms:6-{5-Methoxy-3-[2-oxo-5-sulfamoyl-1,2-dihydro-indol-(3Z)-ylidenemethyl]-indol-1-yl}-hexanoic acid ethyl ester | CHEMBL321976
TypeSmall organic molecule
Emp. Form.C26H29N3O6S
Mol. Mass.511.59
SMILESCCOC(=O)CCCCCn1cc(\C=C2/C(=O)Nc3ccc(cc23)S(N)(=O)=O)c2cc(OC)ccc12