Reaction Details
TargetTyrosine-protein kinase SYK
LigandBDBM50132451
Substrate/Competitorn/a
Meas. Tech.ChEBML_206946
IC50 145±n/a nM
Citation Lai, JYCox, PJPatel, RSadiq, SAldous, DJThurairatnam, SSmith, KWheeler, DJagpal, SParveen, SFenton, GHarrison, TKMcCarthy, CBamborough, P Potent small molecule inhibitors of spleen tyrosine kinase (Syk). Bioorg Med Chem Lett13:3111-4 (2003) Tyrosine-protein kinase SYK
Name:Tyrosine-protein kinase SYK
Type:Enzyme
Mol. Mass.:72079.99
Organism:Homo sapiens (Human)
Description:P43405
Residue:635
BDBM50132451
NameBDBM50132451
Synonyms:3-((5-methoxy-1-methyl-1H-indol-3-yl)methylene)-N-methyl-2-oxoindoline-5-carboxamide CHEMBL318079
TypeSmall organic molecule
Emp. Form.C21H19N3O3
Mol. Mass.361.3939
SMILESCNC(=O)c1ccc2NC(=O)\C(=C/c3cn(C)c4ccc(OC)cc34)c2c1