Reaction Details
TargetPeroxisome proliferator-activated receptor alpha
LigandBDBM50132570
Substrate/Competitorn/a
Meas. Tech.ChEMBL_153546 (CHEMBL766087)
Ki 61±n/a nM
Citation Adams, ADHu, Zvon Langen, DDadiz, AElbrecht, AMacNaul, KLBerger, JPZhou, GDoebber, TWMeurer, RForrest, MJMoller, DEJones, AB O-arylmandelic acids as highly selective human PPAR alpha/gamma agonists. Bioorg Med Chem Lett13:3185-90 (2003) Peroxisome proliferator-activated receptor alpha
Name:Peroxisome proliferator-activated receptor alpha
Type:Enzyme
Mol. Mass.:52222.08
Organism:Homo sapiens (Human)
Description:Q07869
Residue:468
BDBM50132570
NameBDBM50132570
Synonyms:(3-Ethyl-5,7-dipropyl-benzo[d]isoxazol-6-yloxy)-phenyl-acetic acid | CHEMBL326015
TypeSmall organic molecule
Emp. Form.C23H27NO4
Mol. Mass.381.4648
SMILESCCCc1cc2c(CC)noc2c(CCC)c1OC(C(O)=O)c1ccccc1