Reaction Details
TargetPeroxisome proliferator-activated receptor alpha
LigandBDBM50132566
Substrate/Competitorn/a
Meas. Tech.ChEMBL_153546 (CHEMBL766087)
Ki 105±n/a nM
Citation Adams, ADHu, Zvon Langen, DDadiz, AElbrecht, AMacNaul, KLBerger, JPZhou, GDoebber, TWMeurer, RForrest, MJMoller, DEJones, AB O-arylmandelic acids as highly selective human PPAR alpha/gamma agonists. Bioorg Med Chem Lett13:3185-90 (2003) Peroxisome proliferator-activated receptor alpha
Name:Peroxisome proliferator-activated receptor alpha
Type:Enzyme
Mol. Mass.:52222.08
Organism:Homo sapiens (Human)
Description:Q07869
Residue:468
BDBM50132566
NameBDBM50132566
Synonyms:(4-Chloro-phenyl)-(5,7-dipropyl-3-trifluoromethyl-benzo[d]isoxazol-6-yloxy)-acetic acid | CHEMBL430894
TypeSmall organic molecule
Emp. Form.C22H21ClF3NO4
Mol. Mass.455.855
SMILESCCCc1cc2c(noc2c(CCC)c1OC(C(O)=O)c1ccc(Cl)cc1)C(F)(F)F