Reaction Details
TargetPeroxisome proliferator-activated receptor alpha
LigandBDBM50132578
Substrate/Competitorn/a
Meas. Tech.ChEMBL_153546 (CHEMBL766087)
Ki 98±n/a nM
Citation Adams, ADHu, Zvon Langen, DDadiz, AElbrecht, AMacNaul, KLBerger, JPZhou, GDoebber, TWMeurer, RForrest, MJMoller, DEJones, AB O-arylmandelic acids as highly selective human PPAR alpha/gamma agonists. Bioorg Med Chem Lett13:3185-90 (2003) Peroxisome proliferator-activated receptor alpha
Name:Peroxisome proliferator-activated receptor alpha
Type:Enzyme
Mol. Mass.:52222.08
Organism:Homo sapiens (Human)
Description:Q07869
Residue:468
BDBM50132578
NameBDBM50132578
Synonyms:CHEMBL109161 | Phenyl-(7-propyl-3-trifluoromethyl-benzo[d]isoxazol-6-yloxy)-acetic acid
TypeSmall organic molecule
Emp. Form.C19H16F3NO4
Mol. Mass.379.3298
SMILESCCCc1c(OC(C(O)=O)c2ccccc2)ccc2c(noc12)C(F)(F)F