Reaction Details
TargetPeroxisome proliferator-activated receptor alpha
LigandBDBM50132575
Substrate/Competitorn/a
Meas. Tech.ChEBML_153546
Ki 57±n/a nM
Citation Adams, ADHu, Zvon Langen, DDadiz, AElbrecht, AMacNaul, KLBerger, JPZhou, GDoebber, TWMeurer, RForrest, MJMoller, DEJones, AB O-arylmandelic acids as highly selective human PPAR alpha/gamma agonists. Bioorg Med Chem Lett13:3185-90 (2003) Peroxisome proliferator-activated receptor alpha
Name:Peroxisome proliferator-activated receptor alpha
Type:Enzyme
Mol. Mass.:52222.08
Organism:Homo sapiens (Human)
Description:Q07869
Residue:468
BDBM50132575
NameBDBM50132575
Synonyms:4-(Carboxy-phenyl-methoxy)-3-chloro-5-propyl-benzoic acid methyl ester | CHEMBL320925
TypeSmall organic molecule
Emp. Form.C19H19ClO5
Mol. Mass.362.804
SMILESCCCc1cc(cc(Cl)c1OC(C(O)=O)c1ccccc1)C(=O)OC