Reaction Details
TargetPeroxisome proliferator-activated receptor alpha
LigandBDBM24566
Substrate/Competitorn/a
Meas. Tech.ChEBML_153484
Ki 100±n/a nM
Citation Adams, ADHu, Zvon Langen, DDadiz, AElbrecht, AMacNaul, KLBerger, JPZhou, GDoebber, TWMeurer, RForrest, MJMoller, DEJones, AB O-arylmandelic acids as highly selective human PPAR alpha/gamma agonists. Bioorg Med Chem Lett13:3185-90 (2003) Peroxisome proliferator-activated receptor alpha
Name:Peroxisome proliferator-activated receptor alpha
Type:PROTEIN
Mol. Mass.:52343.28
Organism:Mus musculus
Description:ChEMBL_572395
Residue:468
BDBM24566
NameBDBM24566
Synonyms:2-({4-chloro-6-[(2,3-dimethylphenyl)amino]pyrimidin-2-yl}sulfanyl)acetic acid JMC515449 Compound 1 Wyeth 14,643
TypeSmall organic molecule
Emp. Form.C14H14ClN3O2S
Mol. Mass.323.798
SMILESCc1cccc(Nc2cc(Cl)nc(SCC(O)=O)n2)c1C