Reaction Details
TargetBeta-galactoside alpha-2,6-sialyltransferase 1
LigandBDBM50366836
Substrate/Competitorn/a
Meas. Tech.ChEMBL_216152 (CHEMBL817949)
Ki 1700000±n/a nM
Citation Whalen, LJMcEvoy, KAHalcomb, RL Synthesis and evaluation of phosphoramidate amino acid-based inhibitors of sialyltransferases. Bioorg Med Chem Lett13:301-4 (2002) Beta-galactoside alpha-2,6-sialyltransferase 1
Name:Beta-galactoside alpha-2,6-sialyltransferase 1
Type:PROTEIN
Mol. Mass.:46743.36
Organism:Rattus norvegicus
Description:ChEMBL_216152
Residue:403
BDBM50366836
NameBDBM50366836
Synonyms:CHEMBL610554
TypeSmall organic molecule
Emp. Form.C12H19N4O9P
Mol. Mass.394.2744
SMILESC[C@H](NP(O)(=O)OC[C@H]1OC([C@H](O)[C@@H]1O)n1ccc(N)nc1=O)C(O)=O