Reaction Details
TargetSphingosine 1-phosphate receptor 1
LigandBDBM50133427
Substrate/Competitorn/a
Meas. Tech.ChEMBL_201311 (CHEMBL805799)
EC50 598.40±n/a nM
Citation Clemens, JJDavis, MDLynch, KRMacdonald, TL Synthesis of para-alkyl aryl amide analogues of sphingosine-1-phosphate: discovery of potent S1P receptor agonists. Bioorg Med Chem Lett13:3401-4 (2003) Sphingosine 1-phosphate receptor 1
Name:Sphingosine 1-phosphate receptor 1
Type:Enzyme
Mol. Mass.:42836.02
Organism:Homo sapiens (Human)
Description:P21453
Residue:382
BDBM50133427
NameBDBM50133427
Synonyms:CHEMBL324358 | Phosphoric acid mono-((S)-2-amino-2-dodecylcarbamoyl-ethyl) ester; TFA
TypeSmall organic molecule
Emp. Form.C15H33N2O5P
Mol. Mass.352.4067
(=O)[C@@H](N)COP(O)(O)=O