Reaction Details
TargetSphingosine 1-phosphate receptor 3
LigandBDBM50133418
Substrate/Competitorn/a
Meas. Tech.ChEMBL_201326 (CHEMBL806175)
EC50 862.40±n/a nM
Citation Clemens, JJDavis, MDLynch, KRMacdonald, TL Synthesis of para-alkyl aryl amide analogues of sphingosine-1-phosphate: discovery of potent S1P receptor agonists. Bioorg Med Chem Lett13:3401-4 (2003) Sphingosine 1-phosphate receptor 3
Name:Sphingosine 1-phosphate receptor 3
Type:G Protein-Coupled Receptor (GPCR)
Mol. Mass.:42278.13
Organism:Homo sapiens (Human)
Description:Q99500
Residue:378
BDBM50133418
NameBDBM50133418
Synonyms:CHEMBL423691 | Phosphoric acid mono-((S)-2-amino-2-tetradecylcarbamoyl-ethyl) ester; TFA
TypeSmall organic molecule
Emp. Form.C17H37N2O5P
Mol. Mass.380.4598
(=O)[C@@H](N)COP(O)(O)=O