Reaction Details
TargetSphingosine 1-phosphate receptor 3
LigandBDBM50133425
Substrate/Competitorn/a
Meas. Tech.ChEMBL_201326 (CHEMBL806175)
EC50 450±n/a nM
Citation Clemens, JJDavis, MDLynch, KRMacdonald, TL Synthesis of para-alkyl aryl amide analogues of sphingosine-1-phosphate: discovery of potent S1P receptor agonists. Bioorg Med Chem Lett13:3401-4 (2003) Sphingosine 1-phosphate receptor 3
Name:Sphingosine 1-phosphate receptor 3
Type:G Protein-Coupled Receptor (GPCR)
Mol. Mass.:42278.13
Organism:Homo sapiens (Human)
Description:Q99500
Residue:378
BDBM50133425
NameBDBM50133425
Synonyms:CHEMBL227371 Phosphoric acid mono-[(R)-2-amino-2-(4-octyl-phenylcarbamoyl)-ethyl] ester; TFA
TypeSmall organic molecule
Emp. Form.C17H29N2O5P
Mol. Mass.372.3963
SMILESCCCCCCCCc1ccc(NC(=O)[C@H](N)COP(O)(O)=O)cc1