Reaction Details
TargetSphingosine 1-phosphate receptor 1
LigandBDBM50133420
Substrate/Competitorn/a
Meas. Tech.ChEMBL_201311 (CHEMBL805799)
EC50 322.1±n/a nM
Citation Clemens, JJDavis, MDLynch, KRMacdonald, TL Synthesis of para-alkyl aryl amide analogues of sphingosine-1-phosphate: discovery of potent S1P receptor agonists. Bioorg Med Chem Lett13:3401-4 (2003) Sphingosine 1-phosphate receptor 1
Name:Sphingosine 1-phosphate receptor 1
Type:Enzyme
Mol. Mass.:42836.02
Organism:Homo sapiens (Human)
Description:P21453
Residue:382
BDBM50133420
NameBDBM50133420
Synonyms:CHEMBL115505 | Phosphoric acid mono-((S)-2-amino-2-tetradecyloxycarbamoyl-ethyl) ester; TFA
TypeSmall organic molecule
Emp. Form.C17H37N2O6P
Mol. Mass.396.4592
(=O)[C@@H](N)COP(O)(O)=O