Reaction Details
TargetC-C chemokine receptor type 3
LigandBDBM50099482
Substrate/Competitorn/a
Meas. Tech.ChEBML_41922
IC50 2.3±n/a nM
Citation Gong, LHogg, JHCollier, JWilhelm, RSSoderberg, C Design and synthesis of novel CCR3 antagonists. Bioorg Med Chem Lett13:3597-600 (2003) C-C chemokine receptor type 3
Name:C-C chemokine receptor type 3
Type:Enzyme
Mol. Mass.:41053.88
Organism:Homo sapiens (Human)
Description:P51677
Residue:355
BDBM50099482
NameBDBM50099482
Synonyms:2-(6-Amino-benzothiazol-2-ylsulfanyl)-N-[1-(3,4-dichloro-benzyl)-piperidin-4-yl]-acetamide | CHEMBL20921
TypeSmall organic molecule
Emp. Form.C21H22Cl2N4OS2
Mol. Mass.481.462
SMILESNc1ccc2nc(SCC(=O)NC3CCN(Cc4ccc(Cl)c(Cl)c4)CC3)sc2c1