Reaction Details
TargetThymidine phosphorylase
LigandBDBM50134398
Substrate/Competitorn/a
Meas. Tech.ChEMBL_208382 (CHEMBL813749)
Ki 25000000±n/a nM
Citation McNally, VAGbaj, ADouglas, KTStratford, IJJaffar, MFreeman, SBryce, RA Identification of a novel class of inhibitor of human and Escherichia coli thymidine phosphorylase by in silico screening. Bioorg Med Chem Lett13:3705-9 (2003) Thymidine phosphorylase
Name:Thymidine phosphorylase
Type:Enzyme
Mol. Mass.:49948.87
Organism:Homo sapiens (Human)
Description:The recombinant human thymidine phosphorylase (V79TP) was expressed in V79 Chinese hamster cells (Sigma, T-9319).
Residue:482
BDBM50134398
NameBDBM50134398
Synonyms:1-methyl-2,5-dioxo-4-pentylimidazolidine-4-carbaldehyde semicarbazone | CHEMBL124225
TypeSmall organic molecule
Emp. Form.C11H19N5O3
Mol. Mass.269.3003
SMILESCCCCCC1(NC(=O)N(C)C1=O)C=NNC(N)=O