Reaction Details
TargetSodium-dependent serotonin transporter
LigandBDBM22418
Substrate/Competitorn/a
Meas. Tech.ChEMBL_3529 (CHEMBL875081)
IC50 325±n/a nM
Citation Meltzer, PCMcPhee, MMadras, BK Synthesis and biological activity of 2-carbomethoxy-3-catechol-8-azabicyclo[3.2.1]octanes. Bioorg Med Chem Lett13:4133-7 (2003) Sodium-dependent serotonin transporter
Name:Sodium-dependent serotonin transporter
Type:Multi-pass membrane protein
Mol. Mass.:70322.51
Organism:Homo sapiens (Human)
Description:P31645
Residue:630
BDBM22418
NameBDBM22418
Synonyms:Cocaine methyl (1R,2R,3S,5S)-3-(benzoyloxy)-8-methyl-8-azabicyclo[3.2.1]octane-2-carboxylate | methyl (1R,2R,3S,5S)-8-methyl-3-[(phenylcarbonyl)oxy]-8-azabicyclo[3.2.1]octane-2-carboxylate
Typen/a
Emp. Form.C17H21NO4
Mol. Mass.303.3529
SMILES[H][C@]12CC[C@]([H])([C@H]([C@H](C1)OC(=O)c1ccccc1)C(=O)OC)N2C