Reaction Details
TargetPeptidyl-prolyl cis-trans isomerase A
LigandBDBM50136484
Substrate/Competitorn/a
Meas. Tech.ChEBML_92658
IC50 15±n/a nM
Citation Evers, MBarrière, JCBashiardes, GBousseau, ACarry, JCDereu, NFiloche, BHenin, YSablé, SVuilhorgne, MMignani, S Synthesis of non-immunosuppressive cyclophilin-Binding cyclosporin A derivatives as potential anti-HIV-1 drugs. Bioorg Med Chem Lett13:4415-9 (2003) Peptidyl-prolyl cis-trans isomerase A
Name:Peptidyl-prolyl cis-trans isomerase A
Type:Protein
Mol. Mass.:18015.32
Organism:Homo sapiens (Human)
Description:P62937
Residue:165
BDBM50136484
NameBDBM50136484
Synonyms:CHEMBL2407581 | Cyclosporin A analogue
TypeSmall organic molecule
Emp. Form.C68H124N12O12S
Mol. Mass.1333.85
SMILES[H][C@@]1([C@H](O)[C@H](C)C\C=C\C)N(C)C(=O)[C@H](C(C)C)N(C)C(=O)[C@H](CC(C)C)N(C)C(=O)[C@H](CC(C)C)N(C)C(=O)[C@@H](C)NC(=O)[C@H](C)NC(=O)[C@H](CC(C)C)N(C)C(=O)[C@@H](NC(=O)[C@H](CC(C)C)N(C)C(=O)[C@@H](SCCN(CC)CC)N(C)C(=O)[C@H](CC)NC1=O)C(C)C