Reaction Details
TargetReverse transcriptase/RNaseH
LigandBDBM50136488
Substrate/Competitorn/a
Meas. Tech.ChEBML_195221
IC50 959±n/a nM
Citation Evers, MBarrière, JCBashiardes, GBousseau, ACarry, JCDereu, NFiloche, BHenin, YSablé, SVuilhorgne, MMignani, S Synthesis of non-immunosuppressive cyclophilin-Binding cyclosporin A derivatives as potential anti-HIV-1 drugs. Bioorg Med Chem Lett13:4415-9 (2003) Reverse transcriptase/RNaseH
Name:Reverse transcriptase/RNaseH
Type:PROTEIN
Mol. Mass.:65229.15
Organism:Human immunodeficiency virus 1
Description:ChEMBL_1473730
Residue:566
BDBM50136488
NameBDBM50136488
Synonyms:CHEMBL3038086 | [(40-OH) MeLeu]4-CsA derivatives
TypeSmall organic molecule
Emp. Form.C64H115N11O14S
Mol. Mass.1294.728
SMILESCC[C@@H]1NC(=O)[C@H]([C@H](O)[C@H](C)C\C=C\C)N(C)C(=O)[C@H](C(C)C)N(C)C(=O)[C@H](CC(C)C)N(C)C(=O)[C@H](CC(C)C)N(C)C(=O)[C@@H](C)NC(=O)[C@H](C)NC(=O)[C@H](CC(C)C)N(C)C(=O)[C@@H](NC(=O)[C@H](CC(C)(C)O)N(C)C(=O)[C@@H](SCCO)N(C)C1=O)C(C)C