Reaction Details
TargetPeptidyl-prolyl cis-trans isomerase A
LigandBDBM50136487
Substrate/Competitorn/a
Meas. Tech.ChEBML_92658
IC50 166±n/a nM
Citation Evers, MBarrière, JCBashiardes, GBousseau, ACarry, JCDereu, NFiloche, BHenin, YSablé, SVuilhorgne, MMignani, S Synthesis of non-immunosuppressive cyclophilin-Binding cyclosporin A derivatives as potential anti-HIV-1 drugs. Bioorg Med Chem Lett13:4415-9 (2003) Peptidyl-prolyl cis-trans isomerase A
Name:Peptidyl-prolyl cis-trans isomerase A
Type:Protein
Mol. Mass.:18015.32
Organism:Homo sapiens (Human)
Description:P62937
Residue:165
BDBM50136487
NameBDBM50136487
Synonyms:CHEMBL442519 | [(40-OH)MeLeu]4-Cyclosporin A
TypeSmall organic molecule
Emp. Form.C62H111N11O13
Mol. Mass.1218.6106
SMILESCC[C@@H]1NC(=O)C([C@H](O)[C@H](C)C\C=C\C)N(C)C(=O)[C@H](C(C)C)N(C)C(=O)[C@H](CC(C)C)N(C)C(=O)[C@H](CC(C)C)N(C)C(=O)[C@@H](C)NC(=O)[C@H](C)NC(=O)[C@H](CC(C)C)N(C)C(=O)[C@@H](NC(=O)[C@H](CC(C)(C)O)N(C)C(=O)CN(C)C1=O)C(C)C