Reaction Details
TargetDelta-type opioid receptor
LigandBDBM50136594
Substrate/Competitorn/a
Meas. Tech.ChEBML_145607
Ki 1200±n/a nM
Citation Le Bourdonnec, BBelanger, SCassel, JAStabley, GJDeHaven, RNDolle, RE trans-3,4-dimethyl-4-(3-carboxamidophenyl)piperidines: a novel class of micro-selective opioid antagonists. Bioorg Med Chem Lett13:4459-62 (2003) Delta-type opioid receptor
Name:Delta-type opioid receptor
Type:G Protein-Coupled Receptor (GPCR)
Mol. Mass.:40382.98
Organism:Homo sapiens (Human)
Description:Competition binding assays were carried out using membrane preparations from transfected HN9.10 cells that constitutively expressed the delta opioid receptor.
Residue:372
BDBM50136594
NameBDBM50136594
Synonyms:3-((3R,4R)-3,4-Dimethyl-1-phenethyl-piperidin-4-yl)-N-methyl-benzamide | CHEMBL136421
TypeSmall organic molecule
Emp. Form.C23H30N2O
Mol. Mass.350.4971
SMILESCNC(=O)c1cccc(c1)[C@]1(C)CCN(CCc2ccccc2)C[C@@H]1C