Reaction Details
TargetMu-type opioid receptor
LigandBDBM50136604
Substrate/Competitorn/a
Meas. Tech.ChEMBL_148237 (CHEMBL753397)
Ki 11±n/a nM
Citation Le Bourdonnec, BBelanger, SCassel, JAStabley, GJDeHaven, RNDolle, RE trans-3,4-dimethyl-4-(3-carboxamidophenyl)piperidines: a novel class of micro-selective opioid antagonists. Bioorg Med Chem Lett13:4459-62 (2003) Mu-type opioid receptor
Name:Mu-type opioid receptor
Type:G Protein-Coupled Receptor (GPCR)
Mol. Mass.:44789.51
Organism:Homo sapiens (Human)
Description:P35372
Residue:400
BDBM50136604
NameBDBM50136604
Synonyms:CHEMBL138036 | [3-((3R,4R)-3,4-Dimethyl-1-phenethyl-piperidin-4-yl)-phenyl]-methanol
TypeSmall organic molecule
Emp. Form.C22H29NO
Mol. Mass.323.4718
SMILESC[C@H]1CN(CCc2ccccc2)CC[C@@]1(C)c1cccc(CO)c1