Reaction Details
TargetKappa-type opioid receptor
LigandBDBM50136589
Substrate/Competitorn/a
Meas. Tech.ChEBML_145265
Ki 140±n/a nM
Citation Le Bourdonnec, BBelanger, SCassel, JAStabley, GJDeHaven, RNDolle, RE trans-3,4-dimethyl-4-(3-carboxamidophenyl)piperidines: a novel class of micro-selective opioid antagonists. Bioorg Med Chem Lett13:4459-62 (2003) Kappa-type opioid receptor
Name:Kappa-type opioid receptor
Type:G Protein-Coupled Receptor (GPCR)
Mol. Mass.:42648.76
Organism:Homo sapiens (Human)
Description:P41145
Residue:380
BDBM50136589
NameBDBM50136589
Synonyms:3-[(3R,4R)-1-(3-Hydroxy-benzyl)-3,4-dimethyl-piperidin-4-yl]-benzamide | CHEMBL138465
TypeSmall organic molecule
Emp. Form.C21H26N2O2
Mol. Mass.338.4433
SMILESC[C@H]1CN(Cc2cccc(O)c2)CC[C@@]1(C)c1cccc(c1)C(N)=O