Reaction Details
TargetMu-type opioid receptor
LigandBDBM50136591
Substrate/Competitorn/a
Meas. Tech.ChEMBL_148237 (CHEMBL753397)
Ki 0.500000±n/a nM
Citation Le Bourdonnec, BBelanger, SCassel, JAStabley, GJDeHaven, RNDolle, RE trans-3,4-dimethyl-4-(3-carboxamidophenyl)piperidines: a novel class of micro-selective opioid antagonists. Bioorg Med Chem Lett13:4459-62 (2003) Mu-type opioid receptor
Name:Mu-type opioid receptor
Type:G Protein-Coupled Receptor (GPCR)
Mol. Mass.:44789.51
Organism:Homo sapiens (Human)
Description:P35372
Residue:400
BDBM50136591
NameBDBM50136591
Synonyms:3-[(3R,4R)-3,4-Dimethyl-1-(3,5,5-trimethyl-hexyl)-piperidin-4-yl]-benzamide | CHEMBL138930
TypeSmall organic molecule
Emp. Form.C23H38N2O
Mol. Mass.358.5606
SMILESCC(CCN1CC[C@](C)([C@@H](C)C1)c1cccc(c1)C(N)=O)CC(C)(C)C