Reaction Details
TargetKappa-type opioid receptor
LigandBDBM50136588
Substrate/Competitorn/a
Meas. Tech.ChEBML_145265
Ki 460±n/a nM
Citation Le Bourdonnec, BBelanger, SCassel, JAStabley, GJDeHaven, RNDolle, RE trans-3,4-dimethyl-4-(3-carboxamidophenyl)piperidines: a novel class of micro-selective opioid antagonists. Bioorg Med Chem Lett13:4459-62 (2003) Kappa-type opioid receptor
Name:Kappa-type opioid receptor
Type:G Protein-Coupled Receptor (GPCR)
Mol. Mass.:42648.76
Organism:Homo sapiens (Human)
Description:P41145
Residue:380
BDBM50136588
NameBDBM50136588
Synonyms:3-[(3R,4R)-1-(4-Dimethylamino-benzyl)-3,4-dimethyl-piperidin-4-yl]-benzamide | CHEMBL138778
TypeSmall organic molecule
Emp. Form.C23H31N3O
Mol. Mass.365.5117
SMILESC[C@H]1CN(Cc2ccc(cc2)N(C)C)CC[C@@]1(C)c1cccc(c1)C(N)=O