Reaction Details
TargetMu-type opioid receptor
LigandBDBM50136605
Substrate/Competitorn/a
Meas. Tech.ChEMBL_148237 (CHEMBL753397)
Ki 1200±n/a nM
Citation Le Bourdonnec, BBelanger, SCassel, JAStabley, GJDeHaven, RNDolle, RE trans-3,4-dimethyl-4-(3-carboxamidophenyl)piperidines: a novel class of micro-selective opioid antagonists. Bioorg Med Chem Lett13:4459-62 (2003) Mu-type opioid receptor
Name:Mu-type opioid receptor
Type:G Protein-Coupled Receptor (GPCR)
Mol. Mass.:44789.51
Organism:Homo sapiens (Human)
Description:P35372
Residue:400
BDBM50136605
NameBDBM50136605
Synonyms:3-((3R,4R)-3,4-Dimethyl-1-phenethyl-piperidin-4-yl)-N,N-dimethyl-benzamide | CHEMBL138448
TypeSmall organic molecule
Emp. Form.C24H32N2O
Mol. Mass.364.5237
SMILESC[C@H]1CN(CCc2ccccc2)CC[C@@]1(C)c1cccc(c1)C(=O)N(C)C