Reaction Details
TargetKappa-type opioid receptor
LigandBDBM50136586
Substrate/Competitorn/a
Meas. Tech.ChEBML_145265
Ki 1100±n/a nM
Citation Le Bourdonnec, BBelanger, SCassel, JAStabley, GJDeHaven, RNDolle, RE trans-3,4-dimethyl-4-(3-carboxamidophenyl)piperidines: a novel class of micro-selective opioid antagonists. Bioorg Med Chem Lett13:4459-62 (2003) Kappa-type opioid receptor
Name:Kappa-type opioid receptor
Type:G Protein-Coupled Receptor (GPCR)
Mol. Mass.:42648.76
Organism:Homo sapiens (Human)
Description:P41145
Residue:380
BDBM50136586
NameBDBM50136586
Synonyms:CHEMBL138750 | N-[3-((3R,4R)-3,4-Dimethyl-1-phenethyl-piperidin-4-yl)-phenyl]-acetamide
TypeSmall organic molecule
Emp. Form.C23H30N2O
Mol. Mass.350.4971
SMILESC[C@H]1CN(CCc2ccccc2)CC[C@@]1(C)c1cccc(NC(C)=O)c1