Reaction Details
TargetSodium-dependent dopamine transporter
LigandBDBM50123257
Substrate/Competitorn/a
Meas. Tech.ChEBML_62640
Ki 200±n/a nM
Citation Enyedy, IJSakamuri, SZaman, WAJohnson, KMWang, S Pharmacophore-based discovery of substituted pyridines as novel dopamine transporter inhibitors. Bioorg Med Chem Lett13:513-7 (2003) Sodium-dependent dopamine transporter
Name:Sodium-dependent dopamine transporter
Type:Multi-pass membrane protein
Mol. Mass.:68749.45
Organism:Rattus norvegicus (rat)
Description:P23977
Residue:619
BDBM50123257
NameBDBM50123257
Synonyms:4-Benzhydryl-pyridine | CHEMBL150045
TypeSmall organic molecule
Emp. Form.C18H15N
Mol. Mass.245.3184
SMILESc1ccc(cc1)C(c1ccccc1)c1ccncc1