Reaction Details
TargetSodium-dependent dopamine transporter
LigandBDBM50123263
Substrate/Competitorn/a
Meas. Tech.ChEBML_62640
Ki>1000±n/a nM
Citation Enyedy, IJSakamuri, SZaman, WAJohnson, KMWang, S Pharmacophore-based discovery of substituted pyridines as novel dopamine transporter inhibitors. Bioorg Med Chem Lett13:513-7 (2003) Sodium-dependent dopamine transporter
Name:Sodium-dependent dopamine transporter
Type:Multi-pass membrane protein
Mol. Mass.:68749.45
Organism:Rattus norvegicus (rat)
Description:P23977
Residue:619
BDBM50123263
NameBDBM50123263
Synonyms:1-Benzyl-5-chloro-2-phenyl-1H-imidazole | CHEMBL149954
TypeSmall organic molecule
Emp. Form.C16H13ClN2
Mol. Mass.268.741
SMILESClc1cnc(-c2ccccc2)n1Cc1ccccc1