Reaction Details
TargetSodium-dependent dopamine transporter
LigandBDBM50123269
Substrate/Competitorn/a
Meas. Tech.ChEBML_62640
Ki>1000±n/a nM
Citation Enyedy, IJSakamuri, SZaman, WAJohnson, KMWang, S Pharmacophore-based discovery of substituted pyridines as novel dopamine transporter inhibitors. Bioorg Med Chem Lett13:513-7 (2003) Sodium-dependent dopamine transporter
Name:Sodium-dependent dopamine transporter
Type:Multi-pass membrane protein
Mol. Mass.:68749.45
Organism:Rattus norvegicus (rat)
Description:P23977
Residue:619
BDBM50123269
NameBDBM50123269
Synonyms:3-Chloro-5,6-diphenyl-pyridazine-4-carbonitrile | CHEMBL422662
TypeSmall organic molecule
Emp. Form.C17H10ClN3
Mol. Mass.291.734
SMILESClc1nnc(-c2ccccc2)c(-c2ccccc2)c1C#N