Reaction Details
TargetT-cell surface glycoprotein CD4
LigandBDBM50123450
Substrate/Competitorn/a
Meas. Tech.ChEBML_39920
IC50 130±n/a nM
Citation Hegde, VRPuar, MSDai, PPatel, MGullo, VPChan, TMSilver, JPramanik, BNJenh, CH Condensed aromatic peptide family of microbial metabolites, inhibitors of CD28-CD80 interactions. Bioorg Med Chem Lett13:573-5 (2003) T-cell surface glycoprotein CD4
Name:T-cell surface glycoprotein CD4
Type:PROTEIN
Mol. Mass.:51136.66
Organism:Homo sapiens (Human)
Description:ChEMBL_440402
Residue:458
BDBM50123450
NameBDBM50123450
Synonyms:CHEMBL3143464 | Chloropeptin I analogue
TypeSmall organic molecule
Emp. Form.C64H51Cl6N7O16
Mol. Mass.1386.845
SMILESCN1[C@@H](Cc2ccc(Oc3cc4cc(c3O)-c3ccc5c(C[C@@H](NC(=O)C(O)(CC(C)=O)c6cc(Cl)c(O)c(Cl)c6)C(=O)N[C@H](c6cc(Cl)c(O)c(Cl)c6)C(=O)N[C@H]4C(=O)N[C@H](c4cc(Cl)c(O)c(Cl)c4)C1=O)c[nH]c5c3)cc2)C(=O)N[C@@H](C(O)=O)c1ccc(O)cc1