Reaction Details
TargetD(4) dopamine receptor
LigandBDBM84637
Substrate/Competitorn/a
Meas. Tech.ChEMBL_60697 (CHEMBL676507)
Ki 1.8±n/a nM
Citation Einsiedel, JHübner, HGmeiner, P Cyclic amidines as benzamide bioisosteres: EPC synthesis and SAR studies leading to the selective dopamine D4 receptor agonist FAUC 312. Bioorg Med Chem Lett13:851-4 (2003) D(4) dopamine receptor
Name:D(4) dopamine receptor
Type:Enzyme
Mol. Mass.:48373.19
Organism:Homo sapiens (Human)
Description:P21917
Residue:419
BDBM84637
NameBDBM84637
Synonyms:CAS_85760-74-3 NSC_54562 Quinpirole,(-) | US9359372, Quinpirole
TypeSmall organic molecule
Emp. Form.C13H21N3
Mol. Mass.219.3259
SMILESCCCN1CCC[C@@H]2Cc3[nH]ncc3C[C@@H]12