Reaction Details
TargetCarbonic anhydrase 4
LigandBDBM10864
Substrate/Competitorn/a
Meas. Tech.ChEBML_45423
Ki 66±n/a nM
Citation Vullo, DFranchi, MGallori, EPastorek, JScozzafava, APastorekova, SSupuran, CT Carbonic anhydrase inhibitors: inhibition of the tumor-associated isozyme IX with aromatic and heterocyclic sulfonamides. Bioorg Med Chem Lett13:1005-9 (2003) Carbonic anhydrase 4
Name:Carbonic anhydrase 4
Type:Enzyme
Mol. Mass.:35152.74
Organism:Bos taurus (bovine)
Description:Bovine isozyme, isolated from lung microsomes
Residue:312
BDBM10864
NameBDBM10864
Synonyms:4-Amino-3-bromobenzenesulfonamide CHEMBL6724 halogenosulfanilamide deriv. 5d
TypeSmall organic molecule
Emp. Form.C6H7BrN2O2S
Mol. Mass.251.101
SMILESNc1ccc(cc1Br)S(N)(=O)=O