Reaction Details
TargetCarbonic anhydrase 1
LigandBDBM4703
Substrate/Competitorn/a
Meas. Tech.ChEBML_47515
Ki 135±n/a nM
Citation Vullo, DFranchi, MGallori, EPastorek, JScozzafava, APastorekova, SSupuran, CT Carbonic anhydrase inhibitors: inhibition of the tumor-associated isozyme IX with aromatic and heterocyclic sulfonamides. Bioorg Med Chem Lett13:1005-9 (2003) Carbonic anhydrase 1
Name:Carbonic anhydrase 1
Type:Enzyme
Mol. Mass.:28873.37
Organism:Homo sapiens (Human)
Description:P00915
Residue:261
BDBM4703
NameBDBM4703
Synonyms:4-carboxybenzenesulfonamide 1 Benzoic Acid deriv. 31 JMC522226 Compound 22 JMC52646 Compound 23 | aromatic/heteroaromatic sulfonamide 23
TypeSmall organic molecule
Emp. Form.C7H7NO4S
Mol. Mass.201.2
SMILESNS(=O)(=O)c1ccc(cc1)C(O)=O