Reaction Details
TargetCarbonic anhydrase 9
LigandBDBM10855
Substrate/Competitorn/a
Meas. Tech.ChEBML_45443
Ki 33±n/a nM
Citation Vullo, DFranchi, MGallori, EPastorek, JScozzafava, APastorekova, SSupuran, CT Carbonic anhydrase inhibitors: inhibition of the tumor-associated isozyme IX with aromatic and heterocyclic sulfonamides. Bioorg Med Chem Lett13:1005-9 (2003) Carbonic anhydrase 9
Name:Carbonic anhydrase 9
Type:Enzyme
Mol. Mass.:49669.03
Organism:Homo sapiens (Human)
Description:Catalytic domain of human cloned isozyme was used in the assay
Residue:459
BDBM10855
NameBDBM10855
Synonyms:2-aminobenzene-1-sulfonamide US10172837, 2-aminobenzenesulfonamide orthanilamide 17
TypeSmall organic molecule
Emp. Form.C6H8N2O2S
Mol. Mass.172.205
SMILESNc1ccccc1S(N)(=O)=O