Reaction Details
TargetProstaglandin E2 receptor EP4 subtype
LigandBDBM35847
Substrate/Competitorn/a
Meas. Tech.ChEMBL_157949 (CHEMBL765916)
EC50 3±n/a nM
Citation Billot, XChateauneuf, AChauret, NDenis, DGreig, GMathieu, MCMetters, KMSlipetz, DMYoung, RN Discovery of a potent and selective agonist of the prostaglandin EP4 receptor. Bioorg Med Chem Lett13:1129-32 (2003) Prostaglandin E2 receptor EP4 subtype
Name:Prostaglandin E2 receptor EP4 subtype
Type:Enzyme
Mol. Mass.:53134.53
Organism:Homo sapiens (Human)
Description:P35408
Residue:488
BDBM35847
NameBDBM35847
Synonyms:(15S)-prostaglandin E2 (5Z,13E,15S)-11alpha,15-dihydroxy-9-oxoprosta-5,13-dien-1-oic acid CHEMBL548 PGE2 [3H]PGE2 prostaglandin E2
Typeradiolabeled ligand
Emp. Form.C20H32O5
Mol. Mass.352.4651
SMILESCCCCC[C@H](O)\C=C\[C@H]1[C@H](O)CC(=O)[C@@H]1C\C=C/CCCC(O)=O