Reaction Details
TargetProstaglandin E2 receptor EP1 subtype
LigandBDBM50125398
Substrate/Competitorn/a
Meas. Tech.ChEBML_157946
Ki>13000±n/a nM
Citation Billot, XChateauneuf, AChauret, NDenis, DGreig, GMathieu, MCMetters, KMSlipetz, DMYoung, RN Discovery of a potent and selective agonist of the prostaglandin EP4 receptor. Bioorg Med Chem Lett13:1129-32 (2003) Prostaglandin E2 receptor EP1 subtype
Name:Prostaglandin E2 receptor EP1 subtype
Type:Enzyme
Mol. Mass.:41834.57
Organism:Homo sapiens (Human)
Description:P34995
Residue:402
BDBM50125398
NameBDBM50125398
Synonyms:3-{4-[(R)-2-((E)-3-Hydroxy-4-phenyl-but-1-enyl)-5-oxo-pyrrolidin-1-yl]-butylsulfanyl}-propionic acid | CHEMBL14439
TypeSmall organic molecule
Emp. Form.C21H29NO4S
Mol. Mass.391.524
SMILESOC(Cc1ccccc1)\C=C\[C@H]1CCC(=O)N1CCCCSCCC(O)=O