Reaction Details
TargetProstaglandin E2 receptor EP4 subtype
LigandBDBM50125403
Substrate/Competitorn/a
Meas. Tech.ChEBML_158331
Ki 35±n/a nM
Citation Billot, XChateauneuf, AChauret, NDenis, DGreig, GMathieu, MCMetters, KMSlipetz, DMYoung, RN Discovery of a potent and selective agonist of the prostaglandin EP4 receptor. Bioorg Med Chem Lett13:1129-32 (2003) Prostaglandin E2 receptor EP4 subtype
Name:Prostaglandin E2 receptor EP4 subtype
Type:Enzyme
Mol. Mass.:53134.53
Organism:Homo sapiens (Human)
Description:P35408
Residue:488
BDBM50125403
NameBDBM50125403
Synonyms:7-[2-(3-Hydroxy-octyl)-5-oxo-pyrrolidin-1-yl]-heptanoic acid | CHEMBL15096
TypeSmall organic molecule
Emp. Form.C19H35NO4
Mol. Mass.341.4855
SMILESCCCCCC(O)CCC1CCC(=O)N1CCCCCCC(O)=O