Reaction Details
TargetProstaglandin F2-alpha receptor
LigandBDBM50125405
Substrate/Competitorn/a
Meas. Tech.ChEBML_157964
Ki>13000±n/a nM
Citation Billot, XChateauneuf, AChauret, NDenis, DGreig, GMathieu, MCMetters, KMSlipetz, DMYoung, RN Discovery of a potent and selective agonist of the prostaglandin EP4 receptor. Bioorg Med Chem Lett13:1129-32 (2003) Prostaglandin F2-alpha receptor
Name:Prostaglandin F2-alpha receptor
Type:Enzyme
Mol. Mass.:40072.29
Organism:Homo sapiens (Human)
Description:P43088
Residue:359
BDBM50125405
NameBDBM50125405
Synonyms:(R)-5-((E)-(S)-3-Hydroxy-4-phenyl-but-1-enyl)-1-[6-(1H-tetrazol-5-yl)-hexyl]-pyrrolidin-2-one | CHEMBL275667
TypeSmall organic molecule
Emp. Form.C21H29N5O2
Mol. Mass.383.4873
SMILESO[C@@H](Cc1ccccc1)\C=C\[C@H]1CCC(=O)N1CCCCCCc1nnn[nH]1