Reaction Details
TargetProstaglandin E2 receptor EP4 subtype
LigandBDBM50125404
Substrate/Competitorn/a
Meas. Tech.ChEBML_158331
Ki 2100±n/a nM
Citation Billot, XChateauneuf, AChauret, NDenis, DGreig, GMathieu, MCMetters, KMSlipetz, DMYoung, RN Discovery of a potent and selective agonist of the prostaglandin EP4 receptor. Bioorg Med Chem Lett13:1129-32 (2003) Prostaglandin E2 receptor EP4 subtype
Name:Prostaglandin E2 receptor EP4 subtype
Type:Enzyme
Mol. Mass.:53134.53
Organism:Homo sapiens (Human)
Description:P35408
Residue:488
BDBM50125404
NameBDBM50125404
Synonyms:7-[(R)-2-((E)-3-Hydroxy-3-methyl-4-phenyl-but-1-enyl)-5-oxo-pyrrolidin-1-yl]-heptanoic acid | CHEMBL434002
TypeSmall organic molecule
Emp. Form.C22H31NO4
Mol. Mass.373.4858
SMILESCC(O)(Cc1ccccc1)\C=C\[C@H]1CCC(=O)N1CCCCCCC(O)=O