Reaction Details
TargetProstaglandin E2 receptor EP4 subtype
LigandBDBM50125409
Substrate/Competitorn/a
Meas. Tech.ChEBML_158331
Ki 12±n/a nM
Citation Billot, XChateauneuf, AChauret, NDenis, DGreig, GMathieu, MCMetters, KMSlipetz, DMYoung, RN Discovery of a potent and selective agonist of the prostaglandin EP4 receptor. Bioorg Med Chem Lett13:1129-32 (2003) Prostaglandin E2 receptor EP4 subtype
Name:Prostaglandin E2 receptor EP4 subtype
Type:Enzyme
Mol. Mass.:53134.53
Organism:Homo sapiens (Human)
Description:P35408
Residue:488
BDBM50125409
NameBDBM50125409
Synonyms:7-{(R)-2-[(E)-3-Hydroxy-3-(1-phenyl-cyclopropyl)-propenyl]-5-oxo-pyrrolidin-1-yl}-heptanoic acid | CHEMBL280223
TypeSmall organic molecule
Emp. Form.C23H31NO4
Mol. Mass.385.4965
SMILESOC(\C=C\[C@H]1CCC(=O)N1CCCCCCC(O)=O)C1(CC1)c1ccccc1