Reaction Details
TargetProstaglandin E2 receptor EP2 subtype
LigandBDBM50125401
Substrate/Competitorn/a
Meas. Tech.ChEBML_157947
Ki 6680±n/a nM
Citation Billot, XChateauneuf, AChauret, NDenis, DGreig, GMathieu, MCMetters, KMSlipetz, DMYoung, RN Discovery of a potent and selective agonist of the prostaglandin EP4 receptor. Bioorg Med Chem Lett13:1129-32 (2003) Prostaglandin E2 receptor EP2 subtype
Name:Prostaglandin E2 receptor EP2 subtype
Type:Enzyme
Mol. Mass.:39775.71
Organism:Homo sapiens (Human)
Description:P43116
Residue:358
BDBM50125401
NameBDBM50125401
Synonyms:7-[(R)-2-((E)-3-Hydroxy-oct-1-enyl)-5-oxo-pyrrolidin-1-yl]-heptanoic acid | CHEMBL14334
TypeSmall organic molecule
Emp. Form.C19H33NO4
Mol. Mass.339.4696
SMILESCCCCCC(O)\C=C\[C@H]1CCC(=O)N1CCCCCCC(O)=O