Reaction Details
TargetProstaglandin E2 receptor EP4 subtype
LigandBDBM50125418
Substrate/Competitorn/a
Meas. Tech.ChEBML_158331
Ki 3500±n/a nM
Citation Billot, XChateauneuf, AChauret, NDenis, DGreig, GMathieu, MCMetters, KMSlipetz, DMYoung, RN Discovery of a potent and selective agonist of the prostaglandin EP4 receptor. Bioorg Med Chem Lett13:1129-32 (2003) Prostaglandin E2 receptor EP4 subtype
Name:Prostaglandin E2 receptor EP4 subtype
Type:Enzyme
Mol. Mass.:53134.53
Organism:Homo sapiens (Human)
Description:P35408
Residue:488
BDBM50125418
NameBDBM50125418
Synonyms:7-[(R)-2-((E)-3-Cyclohexyl-3-hydroxy-propenyl)-5-oxo-pyrrolidin-1-yl]-heptanoic acid | CHEMBL14530
TypeSmall organic molecule
Emp. Form.C20H33NO4
Mol. Mass.351.4803
SMILESOC(\C=C\[C@H]1CCC(=O)N1CCCCCCC(O)=O)C1CCCCC1