Reaction Details
TargetProstaglandin E2 receptor EP3 subtype
LigandBDBM50125407
Substrate/Competitorn/a
Meas. Tech.ChEBML_157948
Ki 2315±n/a nM
Citation Billot, XChateauneuf, AChauret, NDenis, DGreig, GMathieu, MCMetters, KMSlipetz, DMYoung, RN Discovery of a potent and selective agonist of the prostaglandin EP4 receptor. Bioorg Med Chem Lett13:1129-32 (2003) Prostaglandin E2 receptor EP3 subtype
Name:Prostaglandin E2 receptor EP3 subtype
Type:Enzyme
Mol. Mass.:43335.03
Organism:Homo sapiens (Human)
Description:P43115
Residue:390
BDBM50125407
NameBDBM50125407
Synonyms:7-[(R)-2-(3-Hydroxy-octyl)-5-oxo-pyrrolidin-1-yl]-heptanoic acid | CHEMBL14286
TypeSmall organic molecule
Emp. Form.C19H35NO4
Mol. Mass.341.4855
SMILESCCCCCC(O)CC[C@@H]1CCC(=O)N1CCCCCCC(O)=O