Reaction Details
TargetMu-type opioid receptor
LigandBDBM50370478
Substrate/Competitorn/a
Meas. Tech.ChEMBL_149159 (CHEMBL873303)
Ki 1.5±n/a nM
Citation Stachulski, AVScheinmann, FFerguson, JRLaw, JLLumbard, KWHopkins, PPatel, NClarke, SGloyne, AJoel, SP Structure-activity relationships of some opiate glycosides. Bioorg Med Chem Lett13:1207-14 (2003) Mu-type opioid receptor
Name:Mu-type opioid receptor
Type:G Protein-Coupled Receptor (GPCR)
Mol. Mass.:44503.11
Organism:Rattus norvegicus (rat)
Description:Competition binding assays were carried out using membrane preparations from transfected HN9.10 cells that constitutively expressed the mu opioid receptor.
Residue:398
BDBM50370478
NameBDBM50370478
Synonyms:MORPHINE-6-GLUCURONIDE Morphine-6G
TypeSmall organic molecule
Emp. Form.C23H27NO9
Mol. Mass.461.4618
SMILESCN1CC[C@@]23[C@H]4Oc5c2c(C[C@@H]1[C@@H]3C=C[C@@H]4O[C@@H]1O[C@@H]([C@@H](O)[C@H](O)[C@H]1O)C(O)=O)ccc5O