Reaction Details
TargetMu-type opioid receptor
LigandBDBM50125684
Substrate/Competitorn/a
Meas. Tech.ChEMBL_149159 (CHEMBL873303)
Ki 85±n/a nM
Citation Stachulski, AVScheinmann, FFerguson, JRLaw, JLLumbard, KWHopkins, PPatel, NClarke, SGloyne, AJoel, SP Structure-activity relationships of some opiate glycosides. Bioorg Med Chem Lett13:1207-14 (2003) Mu-type opioid receptor
Name:Mu-type opioid receptor
Type:G Protein-Coupled Receptor (GPCR)
Mol. Mass.:44503.11
Organism:Rattus norvegicus (rat)
Description:Competition binding assays were carried out using membrane preparations from transfected HN9.10 cells that constitutively expressed the mu opioid receptor.
Residue:398
BDBM50125684
NameBDBM50125684
Synonyms:3,4,5-trihydroxy-6-[10-methoxy-4-methyl-(5R,13R,14S,17R)-12-oxa-4-azapentacyclo[9.6.1.01,13.05,17.07,18]octadeca-7(18),8,10,15-tetraen-14-yloxy]tetrahydro-2H-2-pyrancarboxylic acid | CHEMBL3085260
TypeSmall organic molecule
Emp. Form.C24H29NO9
Mol. Mass.475.4884
SMILES[H][C@@]12Oc3c4c(C[C@@]5([H])N(C)CC[C@@]14[C@@]5([H])C=C[C@@H]2O[C@@H]1O[C@H]([C@@H](O)[C@H](O)[C@@H]1O)C(O)=O)ccc3OC