Reaction Details
TargetMu-type opioid receptor
LigandBDBM50125690
Substrate/Competitorn/a
Meas. Tech.ChEMBL_149462 (CHEMBL873928)
Ki 168±n/a nM
Citation Stachulski, AVScheinmann, FFerguson, JRLaw, JLLumbard, KWHopkins, PPatel, NClarke, SGloyne, AJoel, SP Structure-activity relationships of some opiate glycosides. Bioorg Med Chem Lett13:1207-14 (2003) Mu-type opioid receptor
Name:Mu-type opioid receptor
Type:G Protein-Coupled Receptor (GPCR)
Mol. Mass.:44503.11
Organism:Rattus norvegicus (rat)
Description:Competition binding assays were carried out using membrane preparations from transfected HN9.10 cells that constitutively expressed the mu opioid receptor.
Residue:398
BDBM50125690
NameBDBM50125690
Synonyms:6-[10-hydroxy-4-methyl-(5R,13R,14S,17R)-12-oxa-4-azapentacyclo[9.6.1.01,13.05,17.07,18]octadeca-7(18),8,10,15-tetraen-14-yloxy]tetrahydro-2H-2-pyrancarboxylic acid | CHEMBL440787
TypeSmall organic molecule
Emp. Form.C23H27NO6
Mol. Mass.413.4636
SMILESCN1CCC23[C@H]4Oc5c2c(C[C@@H]1[C@@H]3C=C[C@@H]4OC1CCCC(O1)C(O)=O)ccc5O