Reaction Details
TargetSteryl-sulfatase
LigandBDBM50366886
Substrate/Competitorn/a
Meas. Tech.ChEMBL_203055 (CHEMBL811559)
Ki 57000±n/a nM
Citation Lapierre, JAhmed, VChen, MJIspahany, MGuillemette, JGTaylor, SD The difluoromethylene group as a replacement for the labile oxygen in steroid sulfates: a new approach to steroid sulfatase inhibitors. Bioorg Med Chem Lett14:151-5 (2003) Steryl-sulfatase
Name:Steryl-sulfatase
Type:Enzyme
Mol. Mass.:65503.66
Organism:Homo sapiens (Human)
Description:P08842
Residue:583
BDBM50366886
NameBDBM50366886
Synonyms:CHEMBL1628110
TypeSmall organic molecule
Emp. Form.C19H22F2O4S
Mol. Mass.384.437
SMILESC[C@]12CC[C@H]3[C@@H](CCc4cc(ccc34)C(F)(F)S(O)(=O)=O)[C@@H]1CCC2=O